rm -rf build
cmake -S .. -B build -G "Unix Makefiles" -DCMAKE_BUILD_TYPE=Release -DDEVELOPMENT=ON -DTUNING=ON -DINCLUDE_TRACING_MODULE=OFF -DOPENBENCH_COMPLIANCE_MODE=ON  \
	  -DCMAKE_C_COMPILER=cc -DCMAKE_CXX_COMPILER=clang++ \
	  
rm -f illumina_base illumina_bmi2 illumina_avx2
-- The C compiler identification is GNU 12.2.0
-- The CXX compiler identification is Clang 19.1.3
-- Detecting C compiler ABI info
-- Detecting C compiler ABI info - done
-- Check for working C compiler: /mingw64/bin/cc.exe - skipped
-- Detecting C compile features
-- Detecting C compile features - done
-- Detecting CXX compiler ABI info
-- Detecting CXX compiler ABI info - done
-- Check for working CXX compiler: /mingw64/bin/clang++.exe - skipped
-- Detecting CXX compile features
-- Detecting CXX compile features - done
-- NNUE_PATH is set to: /c/Users/THOMAS~1/AppData/Local/Temp/tmpvr0mca25/Illumina/Illumina-tmp/illumina/net/net.json
CMake Warning at CMakeLists.txt:45 (message):
  Could not get commit hash: fatal: detected dubious ownership in repository
  at 'C:/'

  'C:/' is owned by:

  	'S-1-5-80-956008885-3418522649-1831038044-1853292631-2271478464'

  but the current user is:

  	'S-1-5-21-2642087594-14567754-4022365070-1000'

  To add an exception for this directory, call:

  

  	git config --global --add safe.directory C:/

  .


OpenBench compliance mode enabled.
Generating build files for version dev-null_commit on configuration Release.
Litetest submodule not found; tests won't be compiled
-- Configuring done
-- Generating done
-- Build files have been written to: /c/Users/THOMAS~1/AppData/Local/Temp/tmpvr0mca25/Illumina/Illumina-tmp/openbench/build
make[1]: Entering directory '/c/Users/Thomas Mergener/AppData/Local/Temp/tmpvr0mca25/Illumina/Illumina-tmp/openbench/build'
[  3%] Building CXX object illumina/CMakeFiles/illumina_lib_bmi2.dir/types.cpp.o
[  7%] Building CXX object illumina/CMakeFiles/illumina_lib_bmi2.dir/illumina.cpp.o
[ 11%] Building CXX object illumina/CMakeFiles/illumina_lib_bmi2.dir/board.cpp.o
[ 15%] Building CXX object illumina/CMakeFiles/illumina_lib_bmi2.dir/zobrist.cpp.o
[ 19%] Building CXX object illumina/CMakeFiles/illumina_lib_bmi2.dir/parsehelper.cpp.o
[ 23%] Building CXX object illumina/CMakeFiles/illumina_lib_bmi2.dir/attacks.cpp.o
[ 26%] Building CXX object illumina/CMakeFiles/illumina_lib_bmi2.dir/perft.cpp.o
[ 30%] Building CXX object illumina/CMakeFiles/illumina_lib_bmi2.dir/transpositiontable.cpp.o
[ 34%] Building CXX object illumina/CMakeFiles/illumina_lib_bmi2.dir/search.cpp.o
[ 38%] Building CXX object illumina/CMakeFiles/illumina_lib_bmi2.dir/evaluation.cpp.o
[ 42%] Building CXX object illumina/CMakeFiles/illumina_lib_bmi2.dir/timemanager.cpp.o
[ 46%] Building CXX object illumina/CMakeFiles/illumina_lib_bmi2.dir/boardutils.cpp.o
[ 50%] Building CXX object illumina/CMakeFiles/illumina_lib_bmi2.dir/utils.cpp.o
[ 53%] Building CXX object illumina/CMakeFiles/illumina_lib_bmi2.dir/pext_attacks.cpp.o
[ 57%] Building CXX object illumina/CMakeFiles/illumina_lib_bmi2.dir/magic_attacks.cpp.o
[ 61%] Building CXX object illumina/CMakeFiles/illumina_lib_bmi2.dir/tunablevalues.cpp.o
C:/Users/THOMAS~1/AppData/Local/Temp/tmpvr0mca25/Illumina/Illumina-tmp/illumina/search.cpp:680:43: warning: comparison of integers of different signs: 'ui64' (aka 'unsigned long long') and 'int' [-Wsign-compare]
  680 |         && popcount(m_board.color_bb(us)) >= NMP_MIN_PIECES
      |            ~~~~~~~~~~~~~~~~~~~~~~~~~~~~~~ ^  ~~~~~~~~~~~~~~
C:/Users/THOMAS~1/AppData/Local/Temp/tmpvr0mca25/Illumina/Illumina-tmp/illumina/search.cpp:813:27: note: in instantiation of function template specialization 'illumina::SearchWorker::pvs<true, false, false, false>' requested here
  813 |             Score score = pvs<TRACE, false>(depth / 2, se_beta - 1, se_beta, node);
      |                           ^
C:/Users/THOMAS~1/AppData/Local/Temp/tmpvr0mca25/Illumina/Illumina-tmp/illumina/search.cpp:498:21: note: in instantiation of function template specialization 'illumina::SearchWorker::pvs<true, true, false, true>' requested here
  498 |             score = pvs<true, true, false, true>(depth, alpha, beta, &search_stack[0]);
      |                     ^
C:/Users/THOMAS~1/AppData/Local/Temp/tmpvr0mca25/Illumina/Illumina-tmp/illumina/search.cpp:680:43: warning: comparison of integers of different signs: 'ui64' (aka 'unsigned long long') and 'int' [-Wsign-compare]
  680 |         && popcount(m_board.color_bb(us)) >= NMP_MIN_PIECES
      |            ~~~~~~~~~~~~~~~~~~~~~~~~~~~~~~ ^  ~~~~~~~~~~~~~~
C:/Users/THOMAS~1/AppData/Local/Temp/tmpvr0mca25/Illumina/Illumina-tmp/illumina/search.cpp:813:27: note: in instantiation of function template specialization 'illumina::SearchWorker::pvs<false, false, false, false>' requested here
  813 |             Score score = pvs<TRACE, false>(depth / 2, se_beta - 1, se_beta, node);
      |                           ^
C:/Users/THOMAS~1/AppData/Local/Temp/tmpvr0mca25/Illumina/Illumina-tmp/illumina/search.cpp:503:21: note: in instantiation of function template specialization 'illumina::SearchWorker::pvs<false, true, false, true>' requested here
  503 |             score = pvs<false, true, false, true>(depth, alpha, beta, &search_stack[0]);
      |                     ^
[ 65%] Building CXX object illumina/CMakeFiles/illumina_lib_bmi2.dir/endgame.cpp.o
[ 69%] Building CXX object illumina/CMakeFiles/illumina_lib_bmi2.dir/nnue.cpp.o
[ 73%] Building CXX object illumina/CMakeFiles/illumina_lib_bmi2.dir/bench.cpp.o
2 warnings generated.
[ 76%] Linking CXX static library libillumina_bmi2.a
Error running link command: User interrupt
make[4]: *** [illumina/CMakeFiles/illumina_lib_bmi2.dir/build.make:386: illumina/libillumina_bmi2.a] Error 1
make[3]: *** [CMakeFiles/Makefile2:142: illumina/CMakeFiles/illumina_lib_bmi2.dir/all] Error 2
make[2]: *** [CMakeFiles/Makefile2:227: cli/CMakeFiles/illumina_cli_bmi2.dir/rule] Error 2
make[1]: *** [Makefile:173: illumina_cli_bmi2] Error 2
make[1]: Leaving directory '/c/Users/Thomas Mergener/AppData/Local/Temp/tmpvr0mca25/Illumina/Illumina-tmp/openbench/build'
make: *** [Makefile:58: build] Error 2